Target
Aromatase
Ligand
BDBM50025151
Substrate
Meas. Tech.
ChEMBL_51017 (CHEMBL664409)
Ki
1750±n/a nM
Citation
 Daly, MJJones, GWNicholls, PJSmith, HJRowlands, MGBunnett, MA Synthesis and biochemical evaluation of analogues of aminoglutethimide based on phenylpyrrolidine-2,5-dione. J Med Chem 29:520-3 (1986)  
Target
Name:
Aromatase
Synonyms:
ARO1 CP19A_HUMAN CYP19 CYPXIX Cytochrome P450 19A1 Cytochrome P450-C19 (CYP19) FL cytokine receptor precursor | P-450AROM
Type:
Enzyme
Mol. Mass.:
57888.92
Organism:
Homo sapiens (Human)
Description:
P11511
Residue:
503
  
Inhibitor
Name:
BDBM50025151
Synonyms:
3-(4-Amino-phenyl)-1-methyl-pyrrolidine-2,5-dione | CHEMBL357775
Type:
Small organic molecule
Emp. Form.:
C11H12N2O2
Mol. Mass.:
204.2252
SMILES:
CN1C(=O)CC(C1=O)c1ccc(N)cc1
: