Target
Bromodomain-containing protein 4
Ligand
BDBM50465543
Substrate
Meas. Tech.
ChEMBL_1785270 (CHEMBL4256787)
Kd
190±n/a nM
Citation
 Hoffer, LVoitovich, YVRaux, BCarrasco, KMuller, CFedorov, AYDerviaux, CAmouric, ABetzi, SHorvath, DVarnek, ACollette, YCombes, SRoche, PMorelli, X Integrated Strategy for Lead Optimization Based on Fragment Growing: The Diversity-Oriented-Target-Focused-Synthesis Approach. J Med Chem 61:5719-5732 (2018)  
Target
Name:
Bromodomain-containing protein 4
Synonyms:
BRD4 Bromodomain-containing protein 4 (BRD4) Protein HUNK1
Type:
Protein
Mol. Mass.:
152264.84
Organism:
Homo sapiens (Human)
Description:
O60885
Residue:
1362
  
Inhibitor
Name:
BDBM50465543
Synonyms:
CHEMBL4278778
Type:
Small organic molecule
Emp. Form.:
C25H26N6O5S
Mol. Mass.:
522.576
SMILES:
CCn1cnc2n(Cc3ccc(CNS(=O)(=O)c4ccc5NC(=O)CCCc5c4)cc3)c(=O)[nH]c(=O)c12
: