Target
WD repeat-containing protein 5
Ligand
BDBM50465566
Substrate
Meas. Tech.
ChEMBL_1785273 (CHEMBL4256790)
Ki
64000±n/a nM
Citation
 Wang, FJeon, KOSalovich, JMMacdonald, JDAlvarado, JGogliotti, RDPhan, JOlejniczak, ETSun, QWang, SCamper, DYuh, JPShaw, JGSai, JRossanese, OWTansey, WPStauffer, SRFesik, SW Discovery of Potent 2-Aryl-6,7-dihydro-5 H-pyrrolo[1,2- a]imidazoles as WDR5-WIN-Site Inhibitors Using Fragment-Based Methods and Structure-Based Design. J Med Chem 61:5623-5642 (2018)  
Target
Name:
WD repeat-containing protein 5
Synonyms:
BIG3 WD repeat-containing protein 5 (WDR5) WDR5 | WDR5_HUMAN
Type:
Protein
Mol. Mass.:
36597.13
Organism:
Homo sapiens (Human)
Description:
P61964
Residue:
334
  
Inhibitor
Name:
BDBM50465566
Synonyms:
CHEMBL4289013
Type:
Small organic molecule
Emp. Form.:
C13H12N2O2
Mol. Mass.:
228.2466
SMILES:
C1Cc2nc(cn2C1)-c1ccc2OCOc2c1
: