Target
Acetylcholinesterase
Ligand
BDBM50465899
Substrate
Meas. Tech.
ChEMBL_1788969 (CHEMBL4260703)
Ki
42000±n/a nM
Citation
 Zorbaz, TMalinak, DMarakovi?, NMa?ek Hrvat, NZandona, ANovotny, MSkarka, AAndrys, RBenkova, MSoukup, OKatalini?, MKuca, KKovarik, ZMusilek, K Pyridinium Oximes with Ortho-Positioned Chlorine Moiety Exhibit Improved Physicochemical Properties and Efficient Reactivation of Human Acetylcholinesterase Inhibited by Several Nerve Agents. J Med Chem 61:10753-10766 (2018)  
Target
Name:
Acetylcholinesterase
Synonyms:
ACES_HUMAN Acetylcholinesterase (AChE) | Acetylcholinesterase (human AChE)
Type:
Enzyme
Mol. Mass.:
67792.70
Organism:
Homo sapiens (Human)
Description:
P22303
Residue:
614
  
Inhibitor
Name:
BDBM50465899
Synonyms:
CHEMBL4292643
Type:
Small organic molecule
Emp. Form.:
C15H17Br2ClN4O2
Mol. Mass.:
480.582
SMILES:
[Br-].[Br-].NC(=O)c1cc[n+](CCC[n+]2ccc(\C=N\O)c(Cl)c2)cc1
: