Target
Ephrin type-A receptor 7
Ligand
BDBM50466038
Substrate
Meas. Tech.
ChEMBL_1789674 (CHEMBL4261408)
IC50
190±n/a nM
Citation
 Li, YXiong, YZhang, GZhang, LYang, WYang, JHuang, LQiao, ZMiao, ZLin, GSun, QNiu, TChen, LNiu, DLi, LYang, S Identification of 5-(2,3-Dihydro-1 H-indol-5-yl)-7 H-pyrrolo[2,3- d]pyrimidin-4-amine Derivatives as a New Class of Receptor-Interacting Protein Kinase 1 (RIPK1) Inhibitors, Which Showed Potent Activity in a Tumor Metastasis Model. J Med Chem 61:11398-11414 (2018)  
Target
Name:
Ephrin type-A receptor 7
Synonyms:
2.7.10.1 EHK3 EPH homology kinase 3 EPHA7 Ephrin receptor Tyrosine Kinase EPHA6 | Tyrosine Kinase EPHA7
Type:
Mol. Mass.:
112085.32
Organism:
Homo sapiens (Human)
Description:
Residue:
998
  
Inhibitor
Name:
BDBM50466038
Synonyms:
CHEMBL4281823
Type:
Small organic molecule
Emp. Form.:
C25H22F3N5O2
Mol. Mass.:
481.4697
SMILES:
CCn1cc(-c2ccc3N(CCc3c2)C(=O)Cc2cccc(OC(F)(F)F)c2)c2c(N)ncnc12
: