Target
Serine/threonine-protein kinase haspin
Ligand
BDBM50466167
Substrate
Meas. Tech.
ChEMBL_1791735 (CHEMBL4263654)
IC50
12±n/a nM
Citation
 Darwish, SSAbdel-Halim, MSalah, MAbadi, AHBecker, WEngel, M Development of novel 2,4-bispyridyl thiophene-based compounds as highly potent and selective Dyrk1A inhibitors. Part I: Benzamide and benzylamide derivatives. Eur J Med Chem 157:1031-1050 (2018)  
Target
Name:
Serine/threonine-protein kinase haspin
Synonyms:
GSG2 H-haspin HASP_HUMAN | Haploid germ cell-specific nuclear protein kinase
Type:
PROTEIN
Mol. Mass.:
88531.28
Organism:
Homo sapiens (Human)
Description:
ChEMBL_1510616
Residue:
798
  
Inhibitor
Name:
BDBM50466167
Synonyms:
CHEMBL4278808
Type:
Small organic molecule
Emp. Form.:
C20H16FN3O
Mol. Mass.:
333.3589
SMILES:
Oc1ccc(c(F)c1)-c1nc2ccc3[nH]ncc3c2c2CCCCc12
: