Target
Acetylcholinesterase
Ligand
BDBM50152850
Substrate
Meas. Tech.
ChEMBL_1791801 (CHEMBL4263720)
IC50
10150±n/a nM
Citation
 Loesche, AWiemann, JAl Halabi, ZKarasch, JSippl, WCsuk, R Unexpected AChE inhibitory activity of (2E)?,?-unsaturated fatty acids. Bioorg Med Chem Lett 28:3315-3319 (2018)  
Target
Name:
Acetylcholinesterase
Synonyms:
ACES_ELEEL Acetylcholinesterase (EeAChE) | ache
Type:
Enzyme
Mol. Mass.:
71812.79
Organism:
Electrophorus electricus (Electric eel)
Description:
Residue:
633
  
Inhibitor
Name:
BDBM50152850
Synonyms:
1-HEXYLDECANOIC ACID Hexadecanoic acid Palmitic acid (PA)
Type:
Small organic molecule
Emp. Form.:
C16H32O2
Mol. Mass.:
256.4241
SMILES:
CCCCCCCCCCCCCCCC(O)=O
: