Target
Acetylcholinesterase
Ligand
BDBM50466178
Substrate
Meas. Tech.
ChEMBL_1791804 (CHEMBL4263723)
Ki
1510±n/a nM
Citation
 Loesche, AWiemann, JAl Halabi, ZKarasch, JSippl, WCsuk, R Unexpected AChE inhibitory activity of (2E)?,?-unsaturated fatty acids. Bioorg Med Chem Lett 28:3315-3319 (2018)  
Target
Name:
Acetylcholinesterase
Synonyms:
ACES_ELEEL Acetylcholinesterase (EeAChE) | ache
Type:
Enzyme
Mol. Mass.:
71812.79
Organism:
Electrophorus electricus (Electric eel)
Description:
Residue:
633
  
Inhibitor
Name:
BDBM50466178
Synonyms:
CHEMBL4282100
Type:
Small organic molecule
Emp. Form.:
C20H38O2
Mol. Mass.:
310.5145
SMILES:
CCCCCCCCCCCCCCCCC\C=C\C(O)=O
: