Target
Acetylcholinesterase
Ligand
BDBM50463966
Substrate
Meas. Tech.
ChEMBL_1791801 (CHEMBL4263720)
IC50
12800±n/a nM
Citation
 Loesche, AWiemann, JAl Halabi, ZKarasch, JSippl, WCsuk, R Unexpected AChE inhibitory activity of (2E)?,?-unsaturated fatty acids. Bioorg Med Chem Lett 28:3315-3319 (2018)  
Target
Name:
Acetylcholinesterase
Synonyms:
ACES_ELEEL Acetylcholinesterase (EeAChE) | ache
Type:
Enzyme
Mol. Mass.:
71812.79
Organism:
Electrophorus electricus (Electric eel)
Description:
Residue:
633
  
Inhibitor
Name:
BDBM50463966
Synonyms:
CHEBI:28822 | Elcosanoic Acid
Type:
Small organic molecule
Emp. Form.:
C20H40O2
Mol. Mass.:
312.5304
SMILES:
(O)=O
: