Target
Bone morphogenetic protein receptor type-2
Ligand
BDBM50466183
Substrate
Meas. Tech.
ChEMBL_1792070 (CHEMBL4263989)
IC50
>10000±n/a nM
Citation
 Jiang, JKHuang, XShamim, KPatel, PRLee, AWang, AQNguyen, KTawa, GCuny, GDYu, PBZheng, WXu, XSanderson, PHuang, W Discovery of 3-(4-sulfamoylnaphthyl)pyrazolo[1,5-a]pyrimidines as potent and selective ALK2 inhibitors. Bioorg Med Chem Lett 28:3356-3362 (2018)  
Target
Name:
Bone morphogenetic protein receptor type-2
Synonyms:
BMPR2 Bone Morphogenetic Protein Receptor type II (BMPR2) PPH1
Type:
PROTEIN
Mol. Mass.:
115194.11
Organism:
Homo sapiens (Human)
Description:
ChEMBL_774306
Residue:
1038
  
Inhibitor
Name:
BDBM50466183
Synonyms:
CHEMBL4283638
Type:
Small organic molecule
Emp. Form.:
C28H27N5O2S
Mol. Mass.:
497.611
SMILES:
CC(N1CCCC1)c1ccc(cc1)-c1cnc2c(cnn2c1)-c1ccc(c2ccccc12)S(N)(=O)=O
: