Target
Tyrosine-protein kinase BTK
Ligand
BDBM50466204
Substrate
Meas. Tech.
ChEMBL_1792101 (CHEMBL4264020)
IC50
0.800000±n/a nM
Citation
 Qiu, HLiu-Bujalski, LCaldwell, RDViacava Follis, AGardberg, AGoutopoulos, AGrenningloh, RHead, JJohnson, TJones, CCVJones, RMochalkin, IMorandi, FNeagu, CPotnick, JSherer, B Optimization of the efflux ratio and permeability of covalent irreversible BTK inhibitors. Bioorg Med Chem Lett 28:3307-3311 (2018)  
Target
Name:
Tyrosine-protein kinase BTK
Synonyms:
AGMX1 Agammaglobulinaemia tyrosine kinase B cell progenitor kinase BPK BTK_HUMAN Tyrosine Kinase BTK Tyrosine-protein kinase BTK (BTK)
Type:
Enzyme
Mol. Mass.:
76289.95
Organism:
Homo sapiens (Human)
Description:
Q06187
Residue:
659
  
Inhibitor
Name:
BDBM50466204
Synonyms:
CHEMBL4288997
Type:
Small organic molecule
Emp. Form.:
C24H28F2N6O2
Mol. Mass.:
470.5149
SMILES:
NC(=O)c1ccc(nc1Nc1ccc(cc1)N1CCC(F)(F)CC1)N1CC[C@@H](C1)NC(=O)C=C
: