Target
Tyrosine-protein kinase BTK
Ligand
BDBM50466206
Substrate
Meas. Tech.
ChEMBL_1792101 (CHEMBL4264020)
IC50
1.3±n/a nM
Citation
 Qiu, HLiu-Bujalski, LCaldwell, RDViacava Follis, AGardberg, AGoutopoulos, AGrenningloh, RHead, JJohnson, TJones, CCVJones, RMochalkin, IMorandi, FNeagu, CPotnick, JSherer, B Optimization of the efflux ratio and permeability of covalent irreversible BTK inhibitors. Bioorg Med Chem Lett 28:3307-3311 (2018)  
Target
Name:
Tyrosine-protein kinase BTK
Synonyms:
AGMX1 Agammaglobulinaemia tyrosine kinase B cell progenitor kinase BPK BTK_HUMAN Tyrosine Kinase BTK Tyrosine-protein kinase BTK (BTK)
Type:
Enzyme
Mol. Mass.:
76289.95
Organism:
Homo sapiens (Human)
Description:
Q06187
Residue:
659
  
Inhibitor
Name:
BDBM50466206
Synonyms:
CHEMBL4281335
Type:
Small organic molecule
Emp. Form.:
C25H32N6O3
Mol. Mass.:
464.56
SMILES:
C[C@H]1CN(C[C@@H](C)O1)c1ccc(Nc2nc(ccc2C(N)=O)N2CC[C@@H](C2)NC(=O)C=C)cc1
: