Target
CD209 antigen
Ligand
BDBM50466361
Substrate
Meas. Tech.
ChEMBL_1792830 (CHEMBL4264749)
Ki
11000000±n/a nM
Citation
 Kiessling, LL Chemistry-driven glycoscience. Bioorg Med Chem 26:5229-5238 (2018)  
Target
Name:
CD209 antigen
Synonyms:
C-type lectin domain family 4 member L CD209_HUMAN CLEC4L DC-SIGN1 | Dendritic cell-specific ICAM-3-grabbing non-integrin 1
Type:
PROTEIN
Mol. Mass.:
45768.84
Organism:
Homo sapiens (Human)
Description:
ChEMBL_104194
Residue:
404
  
Inhibitor
Name:
BDBM50466361
Synonyms:
CHEBI:63153 | CHEMBL509437
Type:
Small organic molecule
Emp. Form.:
C8H15NO6
Mol. Mass.:
221.2078
SMILES:
CC(=O)N[C@@H]1C(O)O[C@H](CO)[C@@H](O)[C@@H]1O
: