Target
Peptidoglycan-N-acetylglucosamine deacetylase
Ligand
BDBM50466401
Substrate
Meas. Tech.
ChEMBL_1793107 (CHEMBL4265026)
IC50
>5000000±n/a nM
Citation
 DiFrancesco, BRMorrison, ZANitz, M Monosaccharide inhibitors targeting carbohydrate esterase family 4 de-N-acetylases. Bioorg Med Chem 26:5631-5643 (2018)  
Target
Name:
Peptidoglycan-N-acetylglucosamine deacetylase
Synonyms:
PGDA_STRR6 pgdA
Type:
Protein
Mol. Mass.:
52665.99
Organism:
Streptococcus pneumoniae (Firmicutes)
Description:
Q8DP63
Residue:
463
  
Inhibitor
Name:
BDBM50466401
Synonyms:
CHEMBL4284398
Type:
Small organic molecule
Emp. Form.:
C21H27NO7S
Mol. Mass.:
437.507
SMILES:
NS(=O)(=O)C[C@@H]1[C@@H](O)[C@H](OCc2ccccc2)[C@@H](CO)O[C@H]1OCc1ccccc1
: