Target
Peptidoglycan-N-acetylglucosamine deacetylase
Ligand
BDBM50466405
Substrate
Meas. Tech.
ChEMBL_1793107 (CHEMBL4265026)
IC50
>5000000±n/a nM
Citation
 DiFrancesco, BRMorrison, ZANitz, M Monosaccharide inhibitors targeting carbohydrate esterase family 4 de-N-acetylases. Bioorg Med Chem 26:5631-5643 (2018)  
Target
Name:
Peptidoglycan-N-acetylglucosamine deacetylase
Synonyms:
PGDA_STRR6 pgdA
Type:
Protein
Mol. Mass.:
52665.99
Organism:
Streptococcus pneumoniae (Firmicutes)
Description:
Q8DP63
Residue:
463
  
Inhibitor
Name:
BDBM50466405
Synonyms:
CHEMBL4289694
Type:
Small organic molecule
Emp. Form.:
C22H29O8P
Mol. Mass.:
452.4346
SMILES:
COP(O)(=O)C[C@@H]1[C@@H](O)[C@H](O)[C@@H](COCc2ccccc2)O[C@H]1OCc1ccccc1
: