Target
Peptidoglycan-N-acetylglucosamine deacetylase
Ligand
BDBM50466410
Substrate
Meas. Tech.
ChEMBL_1793120 (CHEMBL4265039)
IC50
5000000±n/a nM
Citation
 DiFrancesco, BRMorrison, ZANitz, M Monosaccharide inhibitors targeting carbohydrate esterase family 4 de-N-acetylases. Bioorg Med Chem 26:5631-5643 (2018)  
Target
Name:
Peptidoglycan-N-acetylglucosamine deacetylase
Synonyms:
PGDA_STRR6 pgdA
Type:
Protein
Mol. Mass.:
52665.99
Organism:
Streptococcus pneumoniae (Firmicutes)
Description:
Q8DP63
Residue:
463
  
Inhibitor
Name:
BDBM50466410
Synonyms:
CHEMBL4294745
Type:
Small organic molecule
Emp. Form.:
C15H21NO5S
Mol. Mass.:
327.396
SMILES:
CC(=O)N[C@@H]1[C@@H](S)[C@H](O)[C@@H](CO)O[C@H]1OCc1ccccc1
: