Target
Neuropeptide Y receptor type 1
Ligand
BDBM50046550
Substrate
Meas. Tech.
ChEMBL_1793334 (CHEMBL4265253)
Ki
398±n/a nM
Citation
 Østergaard, SKofoed, JPaulsson, JFMadsen, KGJorgensen, RWulff, BS Design of Y J Med Chem 61:10519-10530 (2018)  
Target
Name:
Neuropeptide Y receptor type 1
Synonyms:
NPY-Y1 NPY1R NPYR neuropeptide Y receptor Y1
Type:
Enzyme Catalytic Domain
Mol. Mass.:
44399.07
Organism:
Homo sapiens (Human)
Description:
NPY-Y1 NPY1R HUMAN::P25929
Residue:
384
  
Inhibitor
Name:
BDBM50046550
Synonyms:
CHEMBL439122 | Tyr-Pro-Ser-Lys-[Aca]-Arg-His-Tyr-Ile-Asn-Leu-Ile-Thr-Arg-Gln-Arg-Tyr
Type:
Small organic molecule
Emp. Form.:
C102H161N31O25
Mol. Mass.:
2221.5624
SMILES:
CC[C@H](C)[C@H](NC(=O)[C@H](Cc1ccc(O)cc1)NC(=O)[C@H](Cc1cnc[nH]1)NC(=O)[C@H](CCCNC(N)=N)NC(=O)CCCCCNC(=O)[C@H](CCCCN)NC(=O)[C@H](CO)NC(=O)[C@@H]1CCCN1C(=O)[C@@H](N)Cc1ccc(O)cc1)C(=O)N[C@@H](CC(N)=O)C(=O)N[C@@H](CC(C)C)C(=O)N[C@@H]([C@@H](C)CC)C(=O)N[C@@H]([C@@H](C)O)C(=O)N[C@@H](CCCNC(N)=N)C(=O)N[C@@H](CCC(N)=O)C(=O)N[C@@H](CCCNC(N)=N)C(=O)N[C@@H](Cc1ccc(O)cc1)C(O)=O
: