Target
Tyrosine-protein kinase JAK3
Ligand
BDBM209866
Substrate
Meas. Tech.
ChEMBL_1793635 (CHEMBL4265554)
IC50
33±n/a nM
Citation
 Casimiro-Garcia, ATrujillo, JIVajdos, FJuba, BBanker, MEAulabaugh, ABalbo, PBauman, JChrencik, JCoe, JWCzerwinski, RDowty, MKnafels, JDKwon, SLeung, LLiang, SRobinson, RPTelliez, JBUnwalla, RYang, XThorarensen, A Identification of Cyanamide-Based Janus Kinase 3 (JAK3) Covalent Inhibitors. J Med Chem 61:10665-10699 (2018)  
Target
Name:
Tyrosine-protein kinase JAK3
Synonyms:
JAK-3 JAK3_HUMAN Janus kinase 3 (JAK3) L-JAK | Leukocyte janus kinase
Type:
Protein
Mol. Mass.:
125111.08
Organism:
Homo sapiens (Human)
Description:
P52333
Residue:
1124
  
Inhibitor
Name:
BDBM209866
Synonyms:
PF-06651600 US20230348487, Example PF-06651600 | US9617258, Example 5
Type:
Small organic molecule
Emp. Form.:
C15H19N5O
Mol. Mass.:
285.3443
SMILES:
C[C@H]1CC[C@H](CN1C(=O)C=C)Nc1ncnc2[nH]ccc12
: