Target
Sodium channel protein type 9 subunit alpha
Ligand
BDBM145285
Substrate
Meas. Tech.
ChEMBL_1794651 (CHEMBL4266768)
IC50
0.400000±n/a nM
Citation
 McKerrall, SJSutherlin, DP Na Bioorg Med Chem Lett 28:3141-3149 (2018)  
Target
Name:
Sodium channel protein type 9 subunit alpha
Synonyms:
NENA Peripheral sodium channel 1 SCN9A_HUMAN Voltage-gated sodium channel subunit Nav1.7 hNE-Na
Type:
Protein
Mol. Mass.:
226375.97
Organism:
Homo sapiens (Human)
Description:
Q15858
Residue:
1988
  
Inhibitor
Name:
BDBM145285
Synonyms:
US8952169, 64 | US9771376, Example 64
Type:
Small organic molecule
Emp. Form.:
C24H31FN2O4S
Mol. Mass.:
462.577
SMILES:
Fc1cc(OCC23CC4CC(CC(C4)C2)C3)c(cc1C(=O)NS(=O)(=O)N1CCC1)C1CC1
: