Target
Chymotrypsinogen B
Ligand
BDBM50025865
Substrate
Meas. Tech.
ChEMBL_216621 (CHEMBL819193)
Ki
1700±n/a nM
Citation
 Kinder, DHKatzenellenbogen, JA Acylamino boronic acids and difluoroborane analogues of amino acids: potent inhibitors of chymotrypsin and elastase. J Med Chem 28:1917-25 (1986)  
Target
Name:
Chymotrypsinogen B
Synonyms:
Beta-chymotrypsin CTRB1 Chymotrypsin B chain A Chymotrypsin B chain C Synonyms=CTRB
Type:
PROTEIN
Mol. Mass.:
27713.98
Organism:
Homo sapiens (Human)
Description:
ChEMBL_10909
Residue:
263
  
Inhibitor
Name:
BDBM50025865
Synonyms:
CHEMBL292593 | N-[1R-(2-phenyl ethyl)]acetamide difluoroborane
Type:
Small organic molecule
Emp. Form.:
C10H12BF2NO
Mol. Mass.:
211.016
SMILES:
CC(=O)N[C@@H](Cc1ccccc1)B(F)F
: