Target
Pepsin A
Ligand
BDBM50025890
Substrate
Meas. Tech.
ChEMBL_154011 (CHEMBL759132)
Ki
3.00±n/a nM
Citation
 Rich, DH Pepstatin-derived inhibitors of aspartic proteinases. A close look at an apparent transition-state analogue inhibitor. J Med Chem 28:263-73 (1985)  
Target
Name:
Pepsin A
Synonyms:
PEPA_PIG Pepsin | Pepsin A precursor
Type:
Enzyme
Mol. Mass.:
41232.87
Organism:
Porcine
Description:
Residue:
385
  
Inhibitor
Name:
BDBM50025890
Synonyms:
4-Hydroxy-2,7-dimethyl-5-[3-methyl-2-(3-methyl-butyrylamino)-butyrylamino]-octanoic acid (1-isobutylcarbamoyl-ethyl)-amide | CHEMBL315665
Type:
Small organic molecule
Emp. Form.:
C27H52N4O5
Mol. Mass.:
512.7256
SMILES:
CC(C)CNC(=O)[C@H](C)NC(=O)[C@@H](C)CC(O)[C@@H](CC(C)C)NC(=O)[C@H](NC(=O)CC(C)C)C(C)C
: