Target
Intestinal-type alkaline phosphatase
Ligand
BDBM50467824
Substrate
Meas. Tech.
ChEMBL_1797058 (CHEMBL4269175)
IC50
1780±n/a nM
Citation
 Ashraf, AEjaz, SARahman, SUSiddiqui, WAArshad, MNLecka, JSévigny, JZayed, MEMAsiri, AMIqbal, JHartinger, CGHanif, M Hybrid compounds from chalcone and 1,2-benzothiazine pharmacophores as selective inhibitors of alkaline phosphatase isozymes. Eur J Med Chem 159:282-291 (2018)  
Target
Name:
Intestinal-type alkaline phosphatase
Synonyms:
ALPI Intestinal alkaline phosphatase | PPBI_HUMAN
Type:
PROTEIN
Mol. Mass.:
56804.94
Organism:
Homo sapiens (Human)
Description:
ChEMBL_1278525
Residue:
528
  
Inhibitor
Name:
BDBM50467824
Synonyms:
CHEMBL4287165
Type:
Small organic molecule
Emp. Form.:
C15H11NO3S
Mol. Mass.:
285.318
SMILES:
O=C1\C(NS(=O)(=O)c2ccccc12)=C\c1ccccc1
: