Target
Dopamine beta-hydroxylase
Ligand
BDBM50026186
Substrate
Meas. Tech.
ChEBML_59141
Ki
2150000±n/a nM
Citation
 Bargar, TMBroersma, RJCreemer, LCMcCarthy, JRHornsperger, JMPalfreyman, MGWagner, JJung, MJ Unsaturated heterocyclic amines as potent time-dependent inhibitors of dopamine beta-hydroxylase. J Med Chem 29:315-7 (1986)  
Target
Name:
Dopamine beta-hydroxylase
Synonyms:
DBH | DOPO_BOVIN
Type:
PROTEIN
Mol. Mass.:
68136.39
Organism:
Bos taurus
Description:
ChEMBL_50738
Residue:
610
  
Inhibitor
Name:
BDBM50026186
Synonyms:
CHEMBL106130 | Methyl-(2-thiophen-2-yl-allyl)-amine
Type:
Small organic molecule
Emp. Form.:
C8H11NS
Mol. Mass.:
153.245
SMILES:
CNCC(=C)c1cccs1
: