Target
Kinesin-like protein KIF11
Ligand
BDBM50463316
Substrate
Meas. Tech.
ChEMBL_1801098 (CHEMBL4273390)
IC50
26±n/a nM
Citation
 Talapatra, SKTham, CLGuglielmi, PCirilli, RChandrasekaran, BKarpoormath, RCarradori, SKozielski, F Crystal structure of the Eg5 - K858 complex and implications for structure-based design of thiadiazole-containing inhibitors. Eur J Med Chem 156:641-651 (2018)  
Target
Name:
Kinesin-like protein KIF11
Synonyms:
EG5 KIF11_HUMAN Kinesin Spindle Protein Eg5 TRIP5 | kinesin spindle protein
Type:
PROTEIN
Mol. Mass.:
119138.97
Organism:
Homo sapiens (Human)
Description:
ChEMBL_1457426
Residue:
1056
  
Inhibitor
Name:
BDBM50463316
Synonyms:
KF 89617 Kf89617 LY-2523355 | Litronesib
Type:
Small organic molecule
Emp. Form.:
C23H37N5O4S2
Mol. Mass.:
511.701
SMILES:
CCNCCS(=O)(=O)NC[C@]1(SC(NC(=O)C(C)(C)C)=NN1C(=O)C(C)(C)C)c1ccccc1
: