Target
Kinesin-like protein KIF11
Ligand
BDBM50431893
Substrate
Meas. Tech.
ChEMBL_1801097 (CHEMBL4273389)
IC50
6.0±n/a nM
Citation
 Talapatra, SKTham, CLGuglielmi, PCirilli, RChandrasekaran, BKarpoormath, RCarradori, SKozielski, F Crystal structure of the Eg5 - K858 complex and implications for structure-based design of thiadiazole-containing inhibitors. Eur J Med Chem 156:641-651 (2018)  
Target
Name:
Kinesin-like protein KIF11
Synonyms:
EG5 KIF11_HUMAN Kinesin Spindle Protein Eg5 TRIP5 | kinesin spindle protein
Type:
PROTEIN
Mol. Mass.:
119138.97
Organism:
Homo sapiens (Human)
Description:
ChEMBL_1457426
Residue:
1056
  
Inhibitor
Name:
BDBM50431893
Synonyms:
ARRY-520 | CHEMBL2347655
Type:
Small organic molecule
Emp. Form.:
C20H22F2N4O2S
Mol. Mass.:
420.476
SMILES:
CON(C)C(=O)N1N=C(S[C@@]1(CCCN)c1ccccc1)c1cc(F)ccc1F
: