Target
Kinesin-like protein KIF11
Ligand
BDBM50468764
Substrate
Meas. Tech.
ChEMBL_1801095 (CHEMBL4273387)
IC50
53900±n/a nM
Citation
 Talapatra, SKTham, CLGuglielmi, PCirilli, RChandrasekaran, BKarpoormath, RCarradori, SKozielski, F Crystal structure of the Eg5 - K858 complex and implications for structure-based design of thiadiazole-containing inhibitors. Eur J Med Chem 156:641-651 (2018)  
Target
Name:
Kinesin-like protein KIF11
Synonyms:
EG5 KIF11_HUMAN Kinesin Spindle Protein Eg5 TRIP5 | kinesin spindle protein
Type:
PROTEIN
Mol. Mass.:
119138.97
Organism:
Homo sapiens (Human)
Description:
ChEMBL_1457426
Residue:
1056
  
Inhibitor
Name:
BDBM50468764
Synonyms:
CHEMBL4288725
Type:
Small organic molecule
Emp. Form.:
C16H15N3O2S
Mol. Mass.:
313.374
SMILES:
CC(=O)NC1=NN(C(S1)c1cccc2ccccc12)C(C)=O
: