Target
DNA topoisomerase 4 subunit B
Ligand
BDBM50006565
Substrate
Meas. Tech.
ChEMBL_1802726 (CHEMBL4275018)
IC50
700±n/a nM
Citation
 Ho, SYWang, WNg, FMWong, YXPoh, ZYTan, SWEAng, SHLiew, SSJoyner Wong, YSTan, YPoulsen, APendharkar, VSangthongpitag, KManchester, JBasarab, GHill, JKeller, THCherian, J Discovery of dual GyrB/ParE inhibitors active against Gram-negative bacteria. Eur J Med Chem 157:610-621 (2018)  
Target
Name:
DNA topoisomerase 4 subunit B
Synonyms:
DNA Topoisomerase IV Subunit B PARE_ECOLI parE
Type:
Enzyme Subunit
Mol. Mass.:
70233.03
Organism:
Escherichia coli (strain K12)
Description:
Residue:
630
  
Inhibitor
Name:
BDBM50006565
Synonyms:
CHEMBL3235085
Type:
Small organic molecule
Emp. Form.:
C18H14F3N5O3S
Mol. Mass.:
437.396
SMILES:
CCNC(=O)Nc1cc(-c2nc(cs2)C(F)(F)F)c(cn1)-c1cncc(c1)C(O)=O
: