Target
DNA topoisomerase 4 subunit B
Ligand
BDBM50470402
Substrate
Meas. Tech.
ChEMBL_1802726 (CHEMBL4275018)
IC50
21±n/a nM
Citation
 Ho, SYWang, WNg, FMWong, YXPoh, ZYTan, SWEAng, SHLiew, SSJoyner Wong, YSTan, YPoulsen, APendharkar, VSangthongpitag, KManchester, JBasarab, GHill, JKeller, THCherian, J Discovery of dual GyrB/ParE inhibitors active against Gram-negative bacteria. Eur J Med Chem 157:610-621 (2018)  
Target
Name:
DNA topoisomerase 4 subunit B
Synonyms:
DNA Topoisomerase IV Subunit B PARE_ECOLI parE
Type:
Enzyme Subunit
Mol. Mass.:
70233.03
Organism:
Escherichia coli (strain K12)
Description:
Residue:
630
  
Inhibitor
Name:
BDBM50470402
Synonyms:
CHEMBL4278317
Type:
Small organic molecule
Emp. Form.:
C26H25F3N8OS
Mol. Mass.:
554.59
SMILES:
CCNC(=O)Nc1cc(-c2nc(cs2)C(F)(F)F)c(cn1)-c1cc2ncccc2nc1N1CC2CCC1CN2
: