Target
Hydroxyacylglutathione hydrolase, mitochondrial
Ligand
BDBM50026371
Substrate
Meas. Tech.
ChEBML_71300
Ki
6500±n/a nM
Citation
 Bush, PENorton, SJ S-(nitrocarbobenzoxy)glutathiones: potent competitive inhibitors of mammalian glyoxalase II. J Med Chem 28:828-30 (1985)  
Target
Name:
Hydroxyacylglutathione hydrolase, mitochondrial
Synonyms:
GLO2_RAT Hagh | Rsp29
Type:
PROTEIN
Mol. Mass.:
34116.42
Organism:
Rattus norvegicus
Description:
ChEMBL_71301
Residue:
309
  
Inhibitor
Name:
BDBM50026371
Synonyms:
2-Amino-4-[1-(carboxymethyl-carbamoyl)-2-(4-nitro-benzyloxycarbonylsulfanyl)-ethylcarbamoyl]-butyric acid | CHEMBL168630
Type:
Small organic molecule
Emp. Form.:
C18H22N4O10S
Mol. Mass.:
486.453
SMILES:
NC(CCC(=O)NC(CSC(=O)OCc1ccc(cc1)[N+]([O-])=O)C(=O)NCC(O)=O)C(O)=O
: