Target
Non-lysosomal glucosylceramidase
Ligand
BDBM50469237
Substrate
Meas. Tech.
ChEMBL_1803730 (CHEMBL4276022)
IC50
>10000±n/a nM
Citation
 Front, SAlmeida, SZoete, VCharollais-Thoenig, JGallienne, EMarmy, CPilloud, VMarti, RWood, TMartin, ORDemotz, S 4-epi-Isofagomine derivatives as pharmacological chaperones for the treatment of lysosomal diseases linked to ?-galactosidase mutations: Improved synthesis and biological investigations. Bioorg Med Chem 26:5462-5469 (2018)  
Target
Name:
Non-lysosomal glucosylceramidase
Synonyms:
Beta-glucosidase GBA2_HUMAN SPG46
Type:
PROTEIN
Mol. Mass.:
104639.04
Organism:
Homo sapiens (Human)
Description:
ChEMBL_1435476
Residue:
927
  
Inhibitor
Name:
BDBM50469237
Synonyms:
CHEMBL4281031
Type:
Small organic molecule
Emp. Form.:
C7H15NO3
Mol. Mass.:
161.1989
SMILES:
C[C@H]1NC[C@@H](O)[C@@H](O)[C@H]1CO
: