Target
Beta-galactosidase
Ligand
BDBM50469239
Substrate
Meas. Tech.
ChEMBL_1803731 (CHEMBL4276023)
IC50
10.0±n/a nM
Citation
 Front, SAlmeida, SZoete, VCharollais-Thoenig, JGallienne, EMarmy, CPilloud, VMarti, RWood, TMartin, ORDemotz, S 4-epi-Isofagomine derivatives as pharmacological chaperones for the treatment of lysosomal diseases linked to ?-galactosidase mutations: Improved synthesis and biological investigations. Bioorg Med Chem 26:5462-5469 (2018)  
Target
Name:
Beta-galactosidase
Synonyms:
Acid beta-galactosidase ELNR1 GLB1 | Lactase
Type:
PROTEIN
Mol. Mass.:
76074.43
Organism:
Homo sapiens (Human)
Description:
ChEMBL_215886
Residue:
677
  
Inhibitor
Name:
BDBM50469239
Synonyms:
CHEMBL4284436
Type:
Small organic molecule
Emp. Form.:
C14H21NO3
Mol. Mass.:
251.3214
SMILES:
OC[C@@H]1[C@H](O)[C@H](O)CN[C@@H]1CCc1ccccc1
: