Target
Non-lysosomal glucosylceramidase
Ligand
BDBM50182801
Substrate
Meas. Tech.
ChEMBL_1803730 (CHEMBL4276022)
IC50
20±n/a nM
Citation
 Front, SAlmeida, SZoete, VCharollais-Thoenig, JGallienne, EMarmy, CPilloud, VMarti, RWood, TMartin, ORDemotz, S 4-epi-Isofagomine derivatives as pharmacological chaperones for the treatment of lysosomal diseases linked to ?-galactosidase mutations: Improved synthesis and biological investigations. Bioorg Med Chem 26:5462-5469 (2018)  
Target
Name:
Non-lysosomal glucosylceramidase
Synonyms:
Beta-glucosidase GBA2_HUMAN SPG46
Type:
PROTEIN
Mol. Mass.:
104639.04
Organism:
Homo sapiens (Human)
Description:
ChEMBL_1435476
Residue:
927
  
Inhibitor
Name:
BDBM50182801
Synonyms:
(3R,4R,5R)-5-(Hydroxymethyl)piperidine-3,4-diol, 8 5-HYDROXYMETHYL-3,4-DIHYDROXYPIPERIDINE CHEMBL206468 US10081601, Example 1.1 isofagomine
Type:
Small organic molecule
Emp. Form.:
C6H13NO3
Mol. Mass.:
147.1723
SMILES:
OC[C@H]1CNC[C@@H](O)[C@@H]1O
: