Target
Probable maltase-glucoamylase 2
Ligand
BDBM50469238
Substrate
Meas. Tech.
ChEMBL_1803728 (CHEMBL4276020)
IC50
>100000±n/a nM
Citation
 Front, SAlmeida, SZoete, VCharollais-Thoenig, JGallienne, EMarmy, CPilloud, VMarti, RWood, TMartin, ORDemotz, S 4-epi-Isofagomine derivatives as pharmacological chaperones for the treatment of lysosomal diseases linked to ?-galactosidase mutations: Improved synthesis and biological investigations. Bioorg Med Chem 26:5462-5469 (2018)  
Target
Name:
Probable maltase-glucoamylase 2
Synonyms:
3.2.1.3 Glucoamylase MGAM2 Probable maltase-glucoamylase 2
Type:
PROTEIN
Mol. Mass.:
277932.17
Organism:
Homo sapiens
Description:
ChEMBL_116927
Residue:
2515
  
Inhibitor
Name:
BDBM50469238
Synonyms:
CHEMBL4288931
Type:
Small organic molecule
Emp. Form.:
C15H31NO3
Mol. Mass.:
273.4115
SMILES:
CCCCCCCCC[C@H]1NC[C@@H](O)[C@@H](O)[C@H]1CO
: