Target
Prostaglandin G/H synthase 2
Ligand
BDBM50469275
Substrate
Meas. Tech.
ChEMBL_1803883 (CHEMBL4276175)
IC50
250±n/a nM
Citation
 Moraes, ADTOMiranda, MDSJacob, ÍTTAmorim, CADCMoura, ROSilva, SÂSDSoares, MBPAlmeida, SMVSouza, TRCLOliveira, JFSilva, TGDMelo, CMLMoreira, DRMLima, MDCA Synthesis, in vitro and in vivo biological evaluation, COX-1/2 inhibition and molecular docking study of indole-N-acylhydrazone derivatives. Bioorg Med Chem 26:5388-5396 (2018)  
Target
Name:
Prostaglandin G/H synthase 2
Synonyms:
COX2 Cyclooxygenase 2 (COX-2) Cyclooxygenase-2 (COX-2 AA) Cyclooxygenase-2 (COX-2) PGH2_HUMAN PHS II Prostaglandin E synthase/G/H synthase 2 Prostaglandin-endoperoxide synthase 2
Type:
Enzyme
Mol. Mass.:
69003.89
Organism:
Homo sapiens (Human)
Description:
Recombinant Cox-2 provided by Cayman (Cayman Chemical Co.,Ann Arbor, MI).
Residue:
604
  
Inhibitor
Name:
BDBM50469275
Synonyms:
CHEMBL4290673
Type:
Small organic molecule
Emp. Form.:
C12H9BrN4O
Mol. Mass.:
305.13
SMILES:
Brc1ccc2[nH]cc(\C=N\NC(=O)CC#N)c2c1
: