Target
Prostaglandin G/H synthase 1
Ligand
BDBM50469275
Substrate
Meas. Tech.
ChEMBL_1803882 (CHEMBL4276174)
IC50
180±n/a nM
Citation
 Moraes, ADTOMiranda, MDSJacob, ÍTTAmorim, CADCMoura, ROSilva, SÂSDSoares, MBPAlmeida, SMVSouza, TRCLOliveira, JFSilva, TGDMelo, CMLMoreira, DRMLima, MDCA Synthesis, in vitro and in vivo biological evaluation, COX-1/2 inhibition and molecular docking study of indole-N-acylhydrazone derivatives. Bioorg Med Chem 26:5388-5396 (2018)  
Target
Name:
Prostaglandin G/H synthase 1
Synonyms:
COX1 Cyclooxygenase-1 (COX-1) PTGS1 | Prostaglandin G/H synthase (cyclooxygenase)
Type:
Protein
Mol. Mass.:
68868.60
Organism:
Ovis aries (Sheep)
Description:
Residue:
600
  
Inhibitor
Name:
BDBM50469275
Synonyms:
CHEMBL4290673
Type:
Small organic molecule
Emp. Form.:
C12H9BrN4O
Mol. Mass.:
305.13
SMILES:
Brc1ccc2[nH]cc(\C=N\NC(=O)CC#N)c2c1
: