Target
High affinity nerve growth factor receptor
Ligand
BDBM50055496
Substrate
Meas. Tech.
ChEMBL_1804064 (CHEMBL4276356)
IC50
1.7±n/a nM
Citation
 Zhao, JZhang, DZhang, WStashko, MADeRyckere, DVasileiadi, EParker, REHunter, DLiu, QZhang, YNorris-Drouin, JLi, BDrewry, DHKireev, DGraham, DKEarp, HSFrye, SVWang, X Highly Selective MERTK Inhibitors Achieved by a Single Methyl Group. J Med Chem 61:10242-10254 (2018)  
Target
Name:
High affinity nerve growth factor receptor
Synonyms:
2.7.10.1 NTRK1 NTRK1_HUMAN Neurotrophic tyrosine kinase receptor type 1 Synonyms=MTC TRK1-transforming tyrosine kinase protein TRKA GN Trk-A Tropomyosin-related kinase A Tyrosine kinase receptor Tyrosine kinase receptor A Tyrosine kinase receptor A (Trk-A) gp140trk | p140-TrkA
Type:
Mol. Mass.:
87498.18
Organism:
Homo sapiens (Human)
Description:
P04629
Residue:
796
  
Inhibitor
Name:
BDBM50055496
Synonyms:
CHEMBL3326006
Type:
Small organic molecule
Emp. Form.:
C28H40N6O
Mol. Mass.:
476.6568
SMILES:
CCCCNc1ncc2c(cn([C@H]3CC[C@H](O)CC3)c2n1)-c1ccc(CN2CCN(C)CC2)cc1
: