Target
DNA (cytosine-5)-methyltransferase 1
Ligand
BDBM50470562
Substrate
Meas. Tech.
ChEMBL_1803164 (CHEMBL4275456)
Ki
>50000±n/a nM
Citation
 Tao, ZCao, RYan, YHuang, GLv, KLi, WGeng, YZhao, LWang, AHe, QYang, JFan, SHuang, MGuo, HZhong, WLiu, M Design, synthesis and in vitro anti-Zika virus evaluation of novel Sinefungin derivatives. Eur J Med Chem 157:994-1004 (2018)  
Target
Name:
DNA (cytosine-5)-methyltransferase 1
Synonyms:
AIM CXXC9 DNA (cytosine-5)-methyltransferase 1 isoform b DNA methyltransferase HsaI DNMT1 M.HsaI | MCMT
Type:
Enzyme
Mol. Mass.:
183184.85
Organism:
Homo sapiens (Human)
Description:
P26358
Residue:
1616
  
Inhibitor
Name:
BDBM50470562
Synonyms:
CHEMBL1230055
Type:
Small organic molecule
Emp. Form.:
C21H25ClN6O5S
Mol. Mass.:
508.978
SMILES:
N[C@@H](CCSC[C@H]1O[C@H]([C@H](O)[C@@H]1O)n1cnc2c(NCc3cccc(Cl)c3)ncnc12)C(O)=O
: