Target
Cysteinyl leukotriene receptor 1
Ligand
BDBM50469804
Substrate
Meas. Tech.
ChEMBL_52368 (CHEMBL663203)
Ki
0.316228±n/a nM
Citation
 Jacobs, RTBrown, FJCronk, LAAharony, DBuckner, CKKusner, EJKirkland, KMNeilson, KL Substituted 3-(phenylmethyl)-1H-indole-5-carboxamides and 1-(phenylmethyl)indole-6-carboxamides as potent, selective, orally active antagonists of the peptidoleukotrienes. J Med Chem 36:394-409 (1993)  
Target
Name:
Cysteinyl leukotriene receptor 1
Synonyms:
CLTR1_CAVPO | CYSLTR1
Type:
Enzyme Catalytic Domain
Mol. Mass.:
39007.58
Organism:
GUINEA PIG
Description:
Leukotriene D4 0 GUINEA PIG::Q2NNR5
Residue:
340
  
Inhibitor
Name:
BDBM50469804
Synonyms:
CHEMBL339277
Type:
Small organic molecule
Emp. Form.:
C34H39N3O5S
Mol. Mass.:
601.756
SMILES:
CCCn1cc(Cc2ccc(cc2OC)C(=O)NS(=O)(=O)c2ccccc2C)c2cc(ccc12)C(=O)NCC1CCCC1
: