Target
Cysteinyl leukotriene receptor 1
Ligand
BDBM50469816
Substrate
Meas. Tech.
ChEMBL_52368 (CHEMBL663203)
Ki
0.501187±n/a nM
Citation
 Jacobs, RTBrown, FJCronk, LAAharony, DBuckner, CKKusner, EJKirkland, KMNeilson, KL Substituted 3-(phenylmethyl)-1H-indole-5-carboxamides and 1-(phenylmethyl)indole-6-carboxamides as potent, selective, orally active antagonists of the peptidoleukotrienes. J Med Chem 36:394-409 (1993)  
Target
Name:
Cysteinyl leukotriene receptor 1
Synonyms:
CLTR1_CAVPO | CYSLTR1
Type:
Enzyme Catalytic Domain
Mol. Mass.:
39007.58
Organism:
GUINEA PIG
Description:
Leukotriene D4 0 GUINEA PIG::Q2NNR5
Residue:
340
  
Inhibitor
Name:
BDBM50469816
Synonyms:
CHEMBL339242
Type:
Small organic molecule
Emp. Form.:
C34H41N3O5S
Mol. Mass.:
603.771
SMILES:
CCC(CC)CNC(=O)c1ccc2n(cc(Cc3ccc(cc3OC)C(=O)NS(=O)(=O)c3ccccc3C)c2c1)C(C)C
: