Target
DNA topoisomerase 2-alpha/2-beta
Ligand
BDBM50470371
Substrate
Meas. Tech.
ChEMBL_54345 (CHEMBL669720)
IC50
63±n/a nM
Citation
 Su, TLChou, TCKim, JYHuang, JTCiszewska, GRen, WYOtter, GMSirotnak, FMWatanabe, KA 9-substituted acridine derivatives with long half-life and potent antitumor activity: synthesis and structure-activity relationships. J Med Chem 38:3226-35 (1995)  
Target
Name:
DNA topoisomerase 2-alpha/2-beta
Synonyms:
DNA topoisomerase II
Type:
Mol. Mass.:
Description:
ASSAY_ID of ChEMBL is 1821483
Components:
This complex has 2 components.
Component 1
Name:
DNA topoisomerase 2-alpha
Synonyms:
DNA topoisomerase 2-alpha DNA topoisomerase II (Topo II) DNA topoisomerase II, alpha isozyme TOP2A Topoisomerase I/II | Topoisomerase II alpha (HuTopoIIα)
Type:
Protein
Mol. Mass.:
174415.30
Organism:
Homo sapiens (Human)
Description:
P11388
Residue:
1531
  
Component 2
Name:
DNA topoisomerase 2-beta
Synonyms:
DNA topoisomerase II TOP2B | TOP2B_HUMAN
Type:
PROTEIN
Mol. Mass.:
183284.13
Organism:
Homo sapiens (Human)
Description:
ChEMBL_51583
Residue:
1626
  
Inhibitor
Name:
BDBM50470371
Synonyms:
CHEMBL325543
Type:
Small organic molecule
Emp. Form.:
C23H21N3O4S
Mol. Mass.:
435.496
SMILES:
CC(=O)OCc1cc(Nc2c3ccccc3nc3ccccc23)cc(NS(C)(=O)=O)c1
: