Target
Beta-casein
Ligand
BDBM50470945
Substrate
Meas. Tech.
ChEMBL_32297 (CHEMBL646244)
Ki
42±n/a nM
Citation
 Giardinà, DCrucianelli, MRomanelli, RLeonardi, APoggesi, EMelchiorre, C Synthesis and biological profile of the enantiomers of [4-(4-amino-6,7-dimethoxyquinazolin-2-yl)-cis-octahydroquinoxalin- 1-yl]furan-2-ylmethanone (cyclazosin), a potent competitive alpha 1B- adrenoceptor antagonist. J Med Chem 39:4602-7 (1996)  
Target
Name:
Beta-casein
Synonyms:
Beta-casein Csn2 | Csnb
Type:
PROTEIN
Mol. Mass.:
25368.99
Organism:
Rattus norvegicus
Description:
ChEMBL_12483
Residue:
231
  
Inhibitor
Name:
BDBM50470945
Synonyms:
CHEMBL140450
Type:
Small organic molecule
Emp. Form.:
C21H26N2O2
Mol. Mass.:
338.4433
SMILES:
OC(CC=N)CC1CCN(CC1)c1ccccc1Oc1ccccc1
: