Target
Beta-casein
Ligand
BDBM50122826
Substrate
Meas. Tech.
ChEMBL_32297 (CHEMBL646244)
Ki
0.269153±n/a nM
Citation
 Giardinà, DCrucianelli, MRomanelli, RLeonardi, APoggesi, EMelchiorre, C Synthesis and biological profile of the enantiomers of [4-(4-amino-6,7-dimethoxyquinazolin-2-yl)-cis-octahydroquinoxalin- 1-yl]furan-2-ylmethanone (cyclazosin), a potent competitive alpha 1B- adrenoceptor antagonist. J Med Chem 39:4602-7 (1996)  
Target
Name:
Beta-casein
Synonyms:
Beta-casein Csn2 | Csnb
Type:
PROTEIN
Mol. Mass.:
25368.99
Organism:
Rattus norvegicus
Description:
ChEMBL_12483
Residue:
231
  
Inhibitor
Name:
BDBM50122826
Synonyms:
(Cyclazosin)[4-(4-Amino-6,7-dimethoxy-quinazolin-2-yl)-octahydro-quinoxalin-1-yl]-furan-2-yl-methanone [4-(4-Amino-6,7-dimethoxy-quinazolin-2-yl)-octahydro-quinoxalin-1-yl]-furan-2-yl-methanone
Type:
Small organic molecule
Emp. Form.:
C23H27N5O4
Mol. Mass.:
437.4916
SMILES:
COc1cc2nc(nc(N)c2cc1OC)N1CCN(C2CCCCC12)C(=O)c1ccco1
: