Target
Beta-casein
Ligand
BDBM21397
Substrate
Meas. Tech.
ChEMBL_32296 (CHEMBL646243)
Ki
1.5±n/a nM
Citation
 Giardinà, DCrucianelli, MRomanelli, RLeonardi, APoggesi, EMelchiorre, C Synthesis and biological profile of the enantiomers of [4-(4-amino-6,7-dimethoxyquinazolin-2-yl)-cis-octahydroquinoxalin- 1-yl]furan-2-ylmethanone (cyclazosin), a potent competitive alpha 1B- adrenoceptor antagonist. J Med Chem 39:4602-7 (1996)  
Target
Name:
Beta-casein
Synonyms:
Beta-casein Csn2 | Csnb
Type:
PROTEIN
Mol. Mass.:
25368.99
Organism:
Rattus norvegicus
Description:
ChEMBL_12483
Residue:
231
  
Inhibitor
Name:
BDBM21397
Synonyms:
8-[4-(4-fluorophenyl)-4-keto-butyl]-1-phenyl-1,3,8-triazaspiro[4.5]decan-4-one 8-[4-(4-fluorophenyl)-4-oxobutyl]-1-phenyl-1,3,8-triazaspiro[4.5]decan-4-one MLS000028615 SPIPERONE US9359372, Spiperone cid_5265
Type:
radiolabeled ligand
Emp. Form.:
C23H26FN3O2
Mol. Mass.:
395.4698
SMILES:
Fc1ccc(cc1)C(=O)CCCN1CCC2(CC1)N(CNC2=O)c1ccccc1
: