Target
Cannabinoid receptor 1
Ligand
BDBM50032599
Substrate
Meas. Tech.
ChEMBL_46820 (CHEMBL657224)
Ki
912010839±n/a nM
Citation
 Shim, JYCollantes, ERWelsh, WJSubramaniam, BHowlett, ACEissenstat, MAWard, SJ Three-dimensional quantitative structure-activity relationship study of the cannabimimetic (aminoalkyl)indoles using comparative molecular field analysis. J Med Chem 41:4521-32 (1998)  
Target
Name:
Cannabinoid receptor 1
Synonyms:
Brain-type cannabinoid receptor CB-R CNR1_RAT Cannabinoid receptor Cnr1 | Skr6
Type:
G Protein-Coupled Receptor (GPCR)
Mol. Mass.:
52856.55
Organism:
Rattus norvegicus (rat)
Description:
P20272
Residue:
473
  
Inhibitor
Name:
BDBM50032599
Synonyms:
(4-Methoxy-naphthalen-1-yl)-[1-(2-morpholin-4-yl-ethyl)-1H-indol-3-yl]-methanone | CHEMBL81473
Type:
Small organic molecule
Emp. Form.:
C26H26N2O3
Mol. Mass.:
414.4962
SMILES:
COc1ccc(C(=O)c2cn(CCN3CCOCC3)c3ccccc23)c2ccccc12
: