Target
Sodium- and chloride-dependent betaine transporter
Ligand
BDBM50473317
Substrate
Meas. Tech.
ChEMBL_206966 (CHEMBL817277)
IC50
696±n/a nM
Citation
 Andersen, KESørensen, JLLau, JLundt, BFPetersen, HHuusfeldt, POSuzdak, PDSwedberg, MD Synthesis of novel gamma-aminobutyric acid (GABA) uptake inhibitors. 5.(1) Preparation and structure-activity studies of tricyclic analogues of known GABA uptake inhibitors. J Med Chem 44:2152-63 (2001)  
Target
Name:
Sodium- and chloride-dependent betaine transporter
Synonyms:
Na(+)/Cl(-) betaine/GABA transporter Slc6a12 Solute carrier family 6 member 12
Type:
PROTEIN
Mol. Mass.:
69749.57
Organism:
Rattus norvegicus
Description:
ChEMBL_105007
Residue:
614
  
Inhibitor
Name:
BDBM50473317
Synonyms:
CHEMBL553053
Type:
Small organic molecule
Emp. Form.:
C25H33ClN2O3
Mol. Mass.:
444.994
SMILES:
Cl.OC(=O)[C@@H]1CCCN(CCOCCCN2c3ccccc3CCc3ccccc23)C1
: