Target
Sodium- and chloride-dependent betaine transporter
Ligand
BDBM50473320
Substrate
Meas. Tech.
ChEMBL_206966 (CHEMBL817277)
IC50
770±n/a nM
Citation
 Andersen, KESørensen, JLLau, JLundt, BFPetersen, HHuusfeldt, POSuzdak, PDSwedberg, MD Synthesis of novel gamma-aminobutyric acid (GABA) uptake inhibitors. 5.(1) Preparation and structure-activity studies of tricyclic analogues of known GABA uptake inhibitors. J Med Chem 44:2152-63 (2001)  
Target
Name:
Sodium- and chloride-dependent betaine transporter
Synonyms:
Na(+)/Cl(-) betaine/GABA transporter Slc6a12 Solute carrier family 6 member 12
Type:
PROTEIN
Mol. Mass.:
69749.57
Organism:
Rattus norvegicus
Description:
ChEMBL_105007
Residue:
614
  
Inhibitor
Name:
BDBM50473320
Synonyms:
CHEMBL545452
Type:
Small organic molecule
Emp. Form.:
C25H30ClNO3
Mol. Mass.:
427.964
SMILES:
Cl.[#8]-[#6](=O)-[#6@H]-1-[#6]-[#6]-[#6]-[#7](-[#6]-[#6]-[#8]-[#6]\[#6]=[#6]-2\c3ccccc3-[#6]-[#6]-c3ccccc-23)-[#6]-1
: