Target
Fatty acid-binding protein, intestinal
Ligand
BDBM50152850
Substrate
Meas. Tech.
ChEMBL_68775 (CHEMBL684424)
Kd
3715±n/a nM
Citation
 Ishchenko, AVShakhnovich, EI SMall Molecule Growth 2001 (SMoG2001): an improved knowledge-based scoring function for protein-ligand interactions. J Med Chem 45:2770-80 (2002)  
Target
Name:
Fatty acid-binding protein, intestinal
Synonyms:
FABP2 FABPI_HUMAN Fatty acid-binding protein, intestinal Intestinal fatty acid-binding protein (hIFABP)
Type:
Protein
Mol. Mass.:
15207.56
Organism:
Homo sapiens (Human)
Description:
Residue:
132
  
Inhibitor
Name:
BDBM50152850
Synonyms:
1-HEXYLDECANOIC ACID Hexadecanoic acid Palmitic acid (PA)
Type:
Small organic molecule
Emp. Form.:
C16H32O2
Mol. Mass.:
256.4241
SMILES:
CCCCCCCCCCCCCCCC(O)=O
: