Target
Thermolysin
Ligand
BDBM50006112
Substrate
Meas. Tech.
ChEMBL_210406 (CHEMBL814135)
Kd
1288±n/a nM
Citation
 Ishchenko, AVShakhnovich, EI SMall Molecule Growth 2001 (SMoG2001): an improved knowledge-based scoring function for protein-ligand interactions. J Med Chem 45:2770-80 (2002)  
Target
Name:
Thermolysin
Synonyms:
THER_BACTH | npr
Type:
PROTEIN
Mol. Mass.:
60097.54
Organism:
Bacillus thermoproteolyticus
Description:
ChEMBL_1468794
Residue:
548
  
Inhibitor
Name:
BDBM50006112
Synonyms:
((S)-1-Carbamoyl-3-methyl-butyl)-phosphoramidic acid CHEMBL47541 | N~2~-phosphono-L-leucinamide
Type:
Small organic molecule
Emp. Form.:
C6H15N2O4P
Mol. Mass.:
210.1681
SMILES:
CC(C)C[C@H](NP(O)(O)=O)C(N)=O
: