Target
Sodium-dependent dopamine transporter
Ligand
BDBM22199
Substrate
Meas. Tech.
ChEMBL_61681 (CHEMBL670057)
Kd
7.76±n/a nM
Citation
 Benedetti, PMannhold, RCruciani, GPastor, M GBR compounds and mepyramines as cocaine abuse therapeutics: chemometric studies on selectivity using grid independent descriptors (GRIND). J Med Chem 45:1577-84 (2002)  
Target
Name:
Sodium-dependent dopamine transporter
Synonyms:
DA transporter DAT1 Dopamine transporter protein (DAT) SC6A3_HUMAN Sodium-dependent dopamine transporter Solute carrier family 6 member 3
Type:
Multi-pass membrane protein
Mol. Mass.:
68497.11
Organism:
Homo sapiens (Human)
Description:
Q01959
Residue:
620
  
Inhibitor
Name:
BDBM22199
Synonyms:
1-{2-[bis(4-fluorophenyl)methoxy]ethyl}-4-[(2E)-3-phenylprop-2-en-1-yl]piperazine CHEMBL286991 GBR-13,069
Type:
Small organic molecule
Emp. Form.:
C28H30F2N2O
Mol. Mass.:
448.5474
SMILES:
Fc1ccc(cc1)C(OCCN1CCN(C\C=C\c2ccccc2)CC1)c1ccc(F)cc1
: