Target
Somatostatin receptor type 1
Ligand
BDBM50051568
Substrate
Meas. Tech.
ChEMBL_200670 (CHEMBL857867)
Ki
<1000±n/a nM
Citation
 Lewis, IBauer, WAlbert, RChandramouli, NPless, JWeckbecker, GBruns, C A novel somatostatin mimic with broad somatotropin release inhibitory factor receptor binding and superior therapeutic potential. J Med Chem 46:2334-44 (2003)  
Target
Name:
Somatostatin receptor type 1
Synonyms:
SOMATOSTATIN SST1 SS-1-R SS1R SSTR1 | Somatostatin receptor type 1 (SSTR1)
Type:
Enzyme
Mol. Mass.:
42692.81
Organism:
Homo sapiens (Human)
Description:
P30872
Residue:
391
  
Inhibitor
Name:
BDBM50051568
Synonyms:
(3S,6S,9S,12R,15S,18S)-9-(4-Amino-butyl)-3-benzyl-15-(4-hydroxy-benzyl)-12-(1H-indol-3-ylmethyl)-6-isopropyl-1,18-dimethyl-1,4,7,10,13,16hexaaza-cyclooctadecane-2,5,8,11,14,17-hexaone seglitide
Type:
Small organic molecule
Emp. Form.:
C44H56N8O7
Mol. Mass.:
808.9648
SMILES:
CC(C)[C@@H]1NC(=O)[C@H](CCCCN)NC(=O)[C@@H](Cc2c[nH]c3ccccc23)NC(=O)[C@H](Cc2ccc(O)cc2)NC(=O)[C@H](C)N(C)C(=O)[C@H](Cc2ccccc2)NC1=O
: